{% setvar book_path %}/reference/kotlin/androidx/_book.yaml{% endsetvar %} {% include "_shared/_reference-head-tags.html" %}

TestResult.TestStatus

enum TestResult.TestStatus


Summary

Enum Values

ASSUMPTION_FAILURE

Test assumption failure

FAILURE

Test failed.

IGNORED

Test ignored

INCOMPLETE

Test started but not ended

PASSED

Test passed

Public constructors

Enum Values

ASSUMPTION_FAILURE

val TestResult.TestStatus.ASSUMPTION_FAILURE: TestResult.TestStatus

Test assumption failure

FAILURE

val TestResult.TestStatus.FAILURE: TestResult.TestStatus

Test failed.

IGNORED

val TestResult.TestStatus.IGNORED: TestResult.TestStatus

Test ignored

INCOMPLETE

val TestResult.TestStatus.INCOMPLETE: TestResult.TestStatus

Test started but not ended

PASSED

val TestResult.TestStatus.PASSED: TestResult.TestStatus

Test passed

Public constructors

TestStatus

TestStatus()